BDBM50201012 ((2R,3aR,4S,6R,6aR)-4-(hydroxymethyl)-6-(5-methyl-2,4-dioxo-3,4-dihydropyrimidin-1(2H)-yl)-hexahydrofuro[3,4-b]furan-2-yl)methylphosphonic acid::CHEMBL219867
SMILES Cc1cn([C@@H]2O[C@H](CO)[C@H]3C[C@H](CP(O)(O)=O)O[C@@H]23)c(=O)[nH]c1=O
InChI Key InChIKey=SOWJATAUUILJHD-SANCVJEGSA-N
Data  1 KI
  Tab Delimited (TSV)   2D SDfile   Computed 3D by Vconf -m prep SDfile
Find this compound or compounds like it in BindingDB:
Activity Spreadsheet -- Enzyme Inhibition Constant Data from BindingDB
Found 1 hit for monomerid = 50201012
TargetThymidine phosphorylase(Homo sapiens (Human))
Attenuon
Curated by ChEMBL
LigandPNGBDBM50201012(((2R,3aR,4S,6R,6aR)-4-(hydroxymethyl)-6-(5-methyl-...)
Affinity DataKi:  3.34E+4nM. Assay description: Inhibition of human thymidine phosphorylase by continuous spectrophotometric assay
In DepthDetails ArticlePubMed